{"text_format":"1","workbook":"xlsx","n_sheets":16,"sheets":["Introduction","Energy Efficiency","Electrification","Electric Vehicle","Renewables","HIDE Setup","Apartment Buildings","Apartment Buildings (2)","Reverse Calculator","Reverse Calculator_ERF","Climate by postcode","SGEx","SSC (A)","BenchmarkFactors","Rating Bands","NGA Factors 2020"],"not_rendered":{"charts":2,"images":13,"macros":0,"external_links":0,"defined_names":35,"comments":2,"pivot_tables":0},"unopened":[],"bounds":{"document_bytes":16777216,"sheet_cells":100000,"rows_first":2000,"rows_last":500,"rows_between":2000,"halvings":0,"cell_chars":16384,"cell_head_chars":4096},"cells_cut":0,"cells_raw":0,"read":"whole","date_system":"1900"}

{"sheet":"Introduction","index":0,"n_rows":17,"n_cols":5,"rows_kept":17,"cut":false,"hidden":false,"merged":[[0,1,0,3],[3,1,3,3],[4,1,4,3],[14,1,14,2],[16,1,16,2],[17,2,17,4],[2,1,2,4],[1,1,1,4],[8,1,8,2],[9,1,9,2],[12,1,12,2],[13,1,13,2],[15,1,15,2]]}
[null,"Energy Data Sheet\nIntroduction"]
[null,"How to use this work book"]
[null,"Italic notes provide helpful tips to fill out these forms - your facility manager, contractor or supplier may be able to assist with completing this workbook.\nStep 1 - Please fill out the cells in white only.\nStep 2 - Progress with the sections of this workbook relevant to your project.\nStep 3 - Submit this workbook with your grant application."]
[null,"Building Address",null,null,"Application Number - Official Use Only [ Workbook V2026-2027.01 ]"]
[]
[]
[]
[null,"Annual Energy Consumption of the Base Building (common areas)",null,null,"Tips and notes"]
[null,"Residential base building electricity annual consumption (kWh)",null,null,"Residential base building electricity consumption may include common area lighting, air-conditioning, hot water systems, cold water systems, lifts, foyers, gyms, laundries, and swimming pools, etc. It excludes any non-residential spaces (retail and office) electricity consumption."]
[null,"Residential base building gas and LPG annual consumption (MJ)",null,null,"If gas utility bills provide the gas consumption in kWh units, please multiply the value by 3.6 to\nconvert to MJ."]
{"$rows_left_out":8}
{"sheet":"Energy Efficiency","index":1,"n_rows":12,"n_cols":9,"rows_kept":12,"cut":false,"hidden":false,"merged":[[11,2,11,6],[2,1,4,2],[2,3,4,3],[2,6,2,8],[0,1,0,3],[0,4,0,6],[9,1,9,3]]}
[null,"Energy Data Sheet\nEnergy Efficiency"]
[]
[null,"Project Type\n\nPlease select from the dropdown list.\nWhere multiple upgrades are proposed, complete additional rows as required.",null,"Project Description & Brief Calculations\n\nFor example, What standard and energy-efficient options are considered? Where is it located? (max. 50 words)\n\nPlease also provide a brief description of your calculations. ","Standard","Proposed","Measurable Outcome"]
[null,null,null,null,"Estimated annual energy consumption\n\n","Estimated annual energy consumption\n\n","Estimated annual energy saving\n\n","Estimated annual emission reduction\n-via Grid*\n","Estimated annual emission reduction\n-via 100% Renewables*"]
[null,null,null,null,"kWh","kWh","kWh","tCO2-e","tCO2-e"]
[null,"Example","Hot water system","Replacing 1 standard electric hot water system with 1 energy-efficient heat pump hot water system, located in common area gym\nCalculation: Estimated that the standard system runs for 3 hours per day for 365 days, and electrict heat pump has a *COP of 3.5\nStandard est. energy consumption = (3.6kW × 3h × 365 days) = 3,942kWh\nProposed est. energy consumption = 3,942kWh / 3.5 (COP) = 1,126kWh",3942,1126,{"$f":"E6 - F6","v":2816},{"$f":"G6*'HIDE Setup'!B20","v":1.5769599999999999},{"$f":"E6*'HIDE Setup'!B20","v":2.2075199999999997}]
[null,"A","Select",null,null,null,{"$f":"E7 - F7","v":0},{"$f":"G7*'HIDE Setup'!B20","v":0},{"$f":"E7*'HIDE Setup'!B20","v":0}]
[null,{"$f":"CHAR(CODE(B7)+1)","v":"B"},"Select",null,null,null,0,{"$f":"G8*'HIDE Setup'!B20","v":0},{"$f":"E8*'HIDE Setup'!B20","v":0}]
[null,"C","Select",null,null,null,0,{"$f":"G9*'HIDE Setup'!B20","v":0},{"$f":"E9*'HIDE Setup'!B20","v":0}]
[null,"Total",null,null,{"$f":"SUM(E7:E9)","v":0},{"$f":"SUM(F7:F9)","v":0},{"$f":"SUM(G7:G9)","v":0},{"$f":"SUM(H7:H9)","v":0},{"$f":"SUM(I7:I9)","v":0}]
{"$rows_left_out":3}
{"sheet":"Electrification","index":2,"n_rows":12,"n_cols":12,"rows_kept":12,"cut":false,"hidden":false,"merged":[[10,1,10,3],[11,2,11,11],[2,7,2,8],[0,1,0,2],[0,4,0,9],[2,1,4,2],[2,3,4,3],[2,4,2,6],[2,9,2,11],[3,4,3,5]]}
[null,"Energy Data Sheet\nElectrification"]
[]
[null,"Project Type\n\nPlease select from the dropdown list.\nWhere multiple upgrades are proposed, complete additional rows as required.",null,"Project Description & Brief Calculations\n\nFor example, What is currently in place? Where is it located? What is newly proposed?  (maximum 50 words)\n\nPlease also provide a brief description of your calculations. ","Standard",null,null,"Proposed",null,"Measurable Outcome"]
[null,null,null,null,"Estimated annual\nenergy consumption\n\n",null,"Estimated annual\nenergy emissions\n\n","Estimated annual\nenergy consumption\n\n","Estimated annual\nenergy emissions\n\n","Estimated annual energy saving \n\n","Estimated annual emission reduction\n- via Grid*\n","Estimated annual emission reduction\n- via Renewables*"]
[null,null,null,null,"MJ","kWhe","tCO2-e","kWh","tCO2-e","kWhe","tCO2-e","tCO2-e"]
[null,"Example ","Gas cooking appliance replacement"]
[null,"Example ","Gas hot water system replacement","Replace gas hot water system with an efficient electric heat pump hot water system, located in\nCalculation: New electric heat pump with a Coefficient of Performance (COP) of 2 obtained from manufacturers data sheets.\nStandard est. energy consumption is taken from gas bills / meter readings = 20,000MJ (or 5,556kWh)\nProposed est. energy consumption = 5,556kWh / 2 (COP) = 2,778kWh (see note*)",20000,{"$f":"E7*'HIDE Setup'!B26","v":5555.6},{"$f":"E7*'HIDE Setup'!B19","v":1.1126},2778,{"$f":"H7*'HIDE Setup'!B20","v":1.55568},{"$f":"F7-H7","v":2777.6000000000004},{"$f":"G7-I7","v":-0.44307999999999992},{"$f":"G7","v":1.1126}]
[null,"A","Select",null,null,{"$f":"E8*'HIDE Setup'!B26","v":0},{"$f":"E8*'HIDE Setup'!B19","v":0},null,{"$f":"H8*'HIDE Setup'!B20","v":0},{"$f":"F8-H8","v":0},{"$f":"G8-I8","v":0},{"$f":"G8","v":0}]
[null,{"$f":"CHAR(CODE(B8)+1)","v":"B"},"Select",null,null,{"$f":"E9*'HIDE Setup'!B26","v":0},{"$f":"E9*'HIDE Setup'!B19","v":0},null,{"$f":"H9*'HIDE Setup'!B20","v":0},0,0,0]
[null,"C","Select",null,null,{"$f":"E10*'HIDE Setup'!B26","v":0},{"$f":"E10*'HIDE Setup'!B19","v":0},null,{"$f":"H10*'HIDE Setup'!B20","v":0},0,0,0]
{"$rows_left_out":3}
{"sheet":"Electric Vehicle","index":3,"n_rows":13,"n_cols":9,"rows_kept":13,"cut":false,"hidden":false,"merged":[[12,2,12,8],[2,4,2,5],[2,6,2,7],[0,1,0,3],[0,4,0,8],[2,1,4,2],[2,3,4,3],[9,1,9,3],[10,2,10,3],[11,2,11,4]]}
[null,"Energy Data Sheet\nElectric Vehicle"]
[]
[null,"Project Type\n\nPlease select from the dropdown list.\nWhere multiple upgrades are proposed, complete additional rows as required.",null,"Project Description & Brief Calculations\n\nFor example, What is currently in place? Where is it located? What is newly proposed? (maximum 50 words)\n\nPlease also provide a brief description of your calculations. ","Standard",null,"Proposed",null,"Measurable Outcome"]
[null,null,null,null,"Estimated annual\npetrol consumption\n\n","Estimated annual\npetrol emission\n\n","Estimated annual energy consumption \n\n","Estimated annual energy emissions\n\n","Estimated annual emission reduction\n- via Grid*\n"]
[null,null,null,null,"L","tCO2-e","kWh","tCO2-e","tCO2-e"]
[null,"Example","Electrical vehicle charger","Replacing 1x petrol vehicle with an electic vehicle and an on-site charger\nCalculation: An average vehicle *2023 Hyundai Kona driving 12,000 km/year.\nStandard est. energy consumption for an average petrol vehicle at 6.9 L/100 km × 12,000 km/year = 828L\nProposed est. energy consumption for an average electric vehicle at 14.3kWh/100 km × 12,000 km/year = 1,716kWh",828,{"$f":"E6*'HIDE Setup'!B22*'HIDE Setup'!B24","v":1.8868414320000002},1716,{"$f":"G6*'HIDE Setup'!B20","v":0.96095999999999993},{"$f":"F6-H6","v":0.92588143200000028}]
[null,"A","Select",null,null,{"$f":"E7*'HIDE Setup'!B22*'HIDE Setup'!B24","v":0},null,{"$f":"G7*'HIDE Setup'!B20","v":0},{"$f":"F7-H7","v":0}]
[null,{"$f":"CHAR(CODE(B7)+1)","v":"B"},"Select",null,null,{"$f":"E8*'HIDE Setup'!B22*'HIDE Setup'!B24","v":0},null,{"$f":"G8*'HIDE Setup'!B20","v":0},0]
[null,"C","Select",null,null,{"$f":"E9*'HIDE Setup'!B22*'HIDE Setup'!B24","v":0},null,{"$f":"G9*'HIDE Setup'!B20","v":0},0]
[null,"Total",null,null,{"$f":"SUM(E7:E9)","v":0},{"$f":"SUM(F7:F9)","v":0},0,0,0]
{"$rows_left_out":4}
{"sheet":"Renewables","index":4,"n_rows":13,"n_cols":12,"rows_kept":13,"cut":false,"hidden":false,"merged":[[12,2,12,8],[2,1,4,2],[2,3,4,3],[2,7,2,8],[0,1,0,3],[0,5,0,8],[2,4,2,6],[11,1,11,4]]}
[null,"Energy Data Sheet\nRenewables"]
[]
[null,"Project Type\n\nPlease select from the dropdown list.\nWhere multiple upgrades are\nproposed, complete additional\nrows as required.",null,"Project Description & Brief Calculations\n\nFor example, what is the proposed system? What is the kW rating of the solar panels and inverters or the batteries? How is the system connected to the building, via an embedded network or to the common area only? (maximum 50 words)\n\nPlease also provide a brief desciption of your calculations ","Proposed",null,null,"Measurable Outcome"]
[null,null,null,null,"What area does the renewable energy system serve?\n\n","Rated annual renewable energy generation\n\n","Expected annual renewable\nenergy usage\n\n","Estimated annual renewable energy usage\n\n","Estimated annual emission reduction \n\n"]
[null,null,null,null,null,"kWh","kWh","kWh","tCO2-e"]
[null,"Example","Solar PV ","Installation of 25kW of PV with 20kW inverter connected to common area power inc. lobbie, lift and gym.\nCalculation: *On average 1kW PV panel will generate 4.4kWh per day. Analysing the common area energy consumption pattern, it is estimated only 70% renewable energy will be used.\nRated annual output = 4.4kWh x 20 kW x 365days = 32,120 kWh\nExpected annual usage = 32,120kWh x 0.7 = 22,484kWh","Common area",32120,22484,{"$f":"G6","v":22484},{"$f":"H6*'HIDE Setup'!B20","v":12.59104}]
[null,"A","Select",null,null,null,null,{"$f":"G7","v":0},{"$f":"H7*'HIDE Setup'!B20","v":0},null,null,{"$f":"IF(#REF!=\"Yes\",H7,0)","v":{"$error":"#REF!"}}]
[null,{"$f":"CHAR(CODE(B7)+1)","v":"B"},"Select",null,null,null,null,0,{"$f":"H8*'HIDE Setup'!B20","v":0},null,null,{"$f":"IF(#REF!=\"Yes\",H8,0)","v":{"$error":"#REF!"}}]
[null,"C","Select",null,null,null,null,0,{"$f":"H9*'HIDE Setup'!B20","v":0},null,null,{"$f":"IF(#REF!=\"Yes\",H9,0)","v":{"$error":"#REF!"}}]
[null,"D","Select",null,null,null,null,{"$f":"IF(ISNUMBER(G10), G10, \"\")","v":""},{"$f":"IFERROR(H10*'HIDE Setup'!$B$20, \"\")","v":""},null,null,{"$f":"IF(#REF!=\"Yes\",H10,0)","v":{"$error":"#REF!"}}]
{"$rows_left_out":4}
{"sheet":"HIDE Setup","index":5,"n_rows":31,"n_cols":11,"rows_kept":31,"cut":false,"hidden":true,"merged":[]}
["Workbook Setup",null,null,null,null,"Preset text"]
["The (live) version is an unprotected  workbook for City of Perth use only.",null,null,null,null,"Energy Efficiency","Electrification","Renewables","Electric Vehicle","Yes/No","Renewables - Area"]
["Protected password is: CityOfPerthCund@ll",null,null,null,null,"Select","Select","Select","Select",null,"Select"]
[null,null,null,null,null,"Lighting upgrade","Gas hot water system replacement","Solar PV ","Electric vehicle charger","Yes","Common area"]
["Save a copy of the Protected (locked) workbook to upload onto the grants webpage",null,null,null,null,"Hot water system upgrade","Gas space heating system replacement","Solar PV with battery",null,"No","Common area & resdiential units"]
["To Protect the Sheet","To Protect the Workbook ",null,null,null,"Pumps and motors upgrade","Gas cooking appliance replacement","Battery to an existing solar PV",null,null,"Residential units"]
[">Go to Review tab in the menu",">Rightclick on the HIDE Setup tab and select hide",null,null,null,"Lifts upgrade","Other","Other"]
[">Select Protect Sheet",">Ensure ONLY the Intro | Energy Ef. | Electrif. | Electric Ve. | Renew. sheets are shown)",null,null,null,"Air Conditioning upgrade"]
[">Add password",">Go to Review tab in the menu",null,null,null,"Ventilation fans upgrade"]
[">Repeat for all sheets/tabs",">Select Protect Workbook",null,null,null,"Building tuning"]
{"$rows_left_out":22}
{"sheet":"Apartment Buildings","index":6,"n_rows":120,"n_cols":34,"rows_kept":120,"cut":false,"hidden":true,"merged":[[17,7,17,8],[18,7,18,8],[53,7,54,7],[59,7,60,7],[27,7,27,8],[22,7,22,8],[38,7,39,7],[46,7,47,7],[2,3,2,4],[24,7,24,8],[25,7,25,8],[26,7,26,8],[2,5,2,8],[6,1,6,8],[11,7,11,8],[3,1,3,7],[20,7,20,8],[21,7,21,8],[15,7,15,8],[19,7,19,8],[12,7,12,8],[13,7,13,8],[14,7,14,8],[16,7,16,8],[37,1,41,1],[46,5,47,5],[45,1,49,1],[46,4,47,4],[58,4,58,5],[37,4,37,5],[40,4,40,5],[39,2,39,3],[47,2,47,3],[41,4,41,5],[59,4,60,5],[60,2,60,3],[61,4,61,5],[62,4,62,5],[52,1,56,1],[53,4,54,4],[54,2,54,3],[53,5,54,5],[58,1,62,1]]}
[]
[]
[null,null,null,"NSW Government\n4 Parramatta Square\n12 Darcy Street\nParramatta, NSW 2150",null,"T (02) 9995 5000\nE nabers@environment.nsw.gov.au\nW nabers.gov.au "]
[null,"NABERS Energy for Apartment Buildings\nPrediction Tool"]
[null,"Version:",2,null,"Date:","2023-07-04"]
[]
[null,"The emissions factors used to calculate NABERS Energy ratings will be updated every 5 years, to reflect that the electricity grid is decarbonising. This tool helps you understand how ratings are likely to change over time with the following results:\n~ \"Current\" Result: This is the estimated current star rating result of your NABERS Energy rating with Rating Period start date 1 July 2020 onwards. The emissions factors used to calculate these ratings are the updated 2020 National Greenhouse Accounts. \n~ \"Former (Rating Period Prior to 1 July 2020)\" Result: This is the estimated star rating result of your NABERS Energy rating with Rating Period start date prior to 1 July 2020, which uses the old rating calculation.\n~ \"Predicted 2025\" and \"Predicted 2030\" Results: These are predictions of the rating results based on the forecasted electricity grid emission factors. \n~~ Scenario 1 is based on the predictions provided by the Australian Government1. \n~~ Scenario 2 forecasts assume that by 2030 the electricity grid will have decarbonised twice as fast as in Scenario 1.\n\n1Source: Appendix C, Australia's emissions projections. https://www.industry.gov.au/publications/australias-emissions-projections-2020 "]
[]
[]
[null,"ENTER THE APARTMENT BUILDING INFORMATION"]
{"$rows_left_out":111}
{"sheet":"Apartment Buildings (2)","index":7,"n_rows":120,"n_cols":34,"rows_kept":120,"cut":false,"hidden":true,"merged":[[12,7,12,8],[2,3,2,4],[2,5,2,8],[3,1,3,7],[6,1,6,8],[11,7,11,8],[25,7,25,8],[13,7,13,8],[14,7,14,8],[15,7,15,8],[16,7,16,8],[17,7,17,8],[18,7,18,8],[19,7,19,8],[20,7,20,8],[21,7,21,8],[22,7,22,8],[24,7,24,8],[26,7,26,8],[27,7,27,8],[37,1,41,1],[37,4,37,5],[38,7,39,7],[39,2,39,3],[40,4,40,5],[41,4,41,5],[52,1,56,1],[53,4,54,4],[53,5,54,5],[53,7,54,7],[54,2,54,3],[45,1,49,1],[46,4,47,4],[46,5,47,5],[46,7,47,7],[47,2,47,3],[58,1,62,1],[58,4,58,5],[59,4,60,5],[59,7,60,7],[60,2,60,3],[61,4,61,5],[62,4,62,5]]}
[]
[]
[null,null,null,"NSW Government\n4 Parramatta Square\n12 Darcy Street\nParramatta, NSW 2150",null,"T (02) 9995 5000\nE nabers@environment.nsw.gov.au\nW nabers.gov.au "]
[null,"NABERS Energy for Apartment Buildings\nPrediction Tool"]
[null,"Version:",2,null,"Date:","2023-07-04"]
[]
[null,"The emissions factors used to calculate NABERS Energy ratings will be updated every 5 years, to reflect that the electricity grid is decarbonising. This tool helps you understand how ratings are likely to change over time with the following results:\n~ \"Current\" Result: This is the estimated current star rating result of your NABERS Energy rating with Rating Period start date 1 July 2020 onwards. The emissions factors used to calculate these ratings are the updated 2020 National Greenhouse Accounts. \n~ \"Former (Rating Period Prior to 1 July 2020)\" Result: This is the estimated star rating result of your NABERS Energy rating with Rating Period start date prior to 1 July 2020, which uses the old rating calculation.\n~ \"Predicted 2025\" and \"Predicted 2030\" Results: These are predictions of the rating results based on the forecasted electricity grid emission factors. \n~~ Scenario 1 is based on the predictions provided by the Australian Government1. \n~~ Scenario 2 forecasts assume that by 2030 the electricity grid will have decarbonised twice as fast as in Scenario 1.\n\n1Source: Appendix C, Australia's emissions projections. https://www.industry.gov.au/publications/australias-emissions-projections-2020 "]
[]
[]
[null,"ENTER THE APARTMENT BUILDING INFORMATION"]
{"$rows_left_out":111}
{"sheet":"Reverse Calculator","index":8,"n_rows":202,"n_cols":11,"rows_kept":202,"cut":false,"hidden":true,"merged":[[16,3,17,3],[16,4,17,4],[2,5,2,7],[3,1,3,7],[6,1,6,8],[12,3,13,3],[12,4,13,4],[37,7,37,8],[20,1,20,9],[23,7,23,8],[24,7,24,8],[25,7,25,8],[25,9,27,11],[26,7,26,8],[27,7,27,8],[30,1,30,9],[33,7,33,8],[34,7,34,8],[35,7,35,8],[36,7,36,8],[57,1,57,9],[40,1,40,9],[43,7,43,8],[43,9,45,11],[44,1,44,5],[44,7,44,8],[45,7,45,8],[46,7,46,8],[49,1,49,9],[52,7,52,8],[53,7,53,8],[54,7,54,8],[61,3,61,5],[63,3,63,5],[66,3,66,5],[69,3,69,5],[84,3,84,5]]}
[]
[]
[null,null,null,null,"Department of Planning, Industry and Environment\n4 Parramatta Square\nParramatta  NSW 2150","T (02) 9995 5000\nE nabers@environment.nsw.gov.au \nnabers.gov.au "]
[null,"NABERS Energy and Water for Apartment Buildings\nReverse Calculator"]
[null,"Version:",4,1.2,"Date:","2021-05-01"]
[]
[null,"The NABERS Energy and Water for Apartment Buildings reverse calculator helps you calculate the maximum amounts of energy and water a building can use to achieve a star rating that you specify. To ensure you achieve the rating, you should allow a factor of safety, and not design to the minimum figure for each star band. The outputs are the maximum amounts of energy and water allowed to be used to achieve the rating you nominate."]
[]
[]
[null,"1. ENTER THE STAR RATING YOU WISH TO ACHIEVE"]
{"$rows_left_out":193}
{"sheet":"Reverse Calculator_ERF","index":9,"n_rows":202,"n_cols":11,"rows_kept":202,"cut":false,"hidden":true,"merged":[[16,3,17,3],[16,4,17,4],[2,5,2,7],[3,1,3,7],[6,1,6,8],[12,3,13,3],[12,4,13,4],[37,7,37,8],[20,1,20,9],[23,7,23,8],[24,7,24,8],[25,7,25,8],[25,9,27,11],[26,7,26,8],[27,7,27,8],[30,1,30,9],[33,7,33,8],[34,7,34,8],[35,7,35,8],[36,7,36,8],[57,1,57,9],[40,1,40,9],[43,7,43,8],[43,9,45,11],[44,1,44,5],[44,7,44,8],[45,7,45,8],[46,7,46,8],[49,1,49,9],[52,7,52,8],[53,7,53,8],[54,7,54,8],[61,3,61,5],[63,3,63,5],[66,3,66,5],[69,3,69,5],[84,3,84,5]]}
[]
[]
[null,null,null,null,"Department of Planning, Industry and Environment\n4 Parramatta Square\nParramatta  NSW 2150","T (02) 9995 5000\nE nabers@environment.nsw.gov.au \nnabers.gov.au "]
[null,"NABERS Energy and Water for Apartment Buildings\nReverse Calculator"]
[null,"Version:",4,1.2,"Date:","2021-05-01"]
[]
[null,"The NABERS Energy and Water for Apartment Buildings reverse calculator helps you calculate the maximum amounts of energy and water a building can use to achieve a star rating that you specify. To ensure you achieve the rating, you should allow a factor of safety, and not design to the minimum figure for each star band. The outputs are the maximum amounts of energy and water allowed to be used to achieve the rating you nominate."]
[]
[]
[null,"1. ENTER THE STAR RATING YOU WISH TO ACHIEVE"]
{"$rows_left_out":193}
{"sheet":"Climate by postcode","index":10,"n_rows":3730,"n_cols":5,"rows_kept":3730,"cut":false,"hidden":true,"merged":[]}
["Postcode and Climate Zone reference for calculating climate correction factors"]
[]
["Postcode","Climate_zone","HDD","CDD","State"]
[200,64,2186,80,"ACT"]
[211,64,2186,80,"ACT"]
[212,64,2186,80,"ACT"]
[221,64,2186,80,"ACT"]
[230,64,2186,80,"ACT"]
[237,64,2186,80,"ACT"]
[238,64,2186,80,"ACT"]
{"$rows_left_out":3721}
{"sheet":"SGEx","index":11,"n_rows":50,"n_cols":11,"rows_kept":50,"cut":false,"hidden":true,"merged":[[0,0,0,4],[1,0,1,4],[39,0,39,4],[27,6,27,10],[39,6,39,10],[3,0,3,4],[27,0,27,4],[15,0,15,4]]}
["APARTMENT BUILDING RATING"]
["Emission Factor for star rating calculation (Based on EA methodology report 2018)"]
[]
["SGEx (2018)"]
[null,"Electricity\n(SGEe)","Gas\n(SGEg)","Diesel\n(SGEd)","Coal\n(SGEc)"]
["State","(kgCO2/kWh)","(kgCO2/MJ)","(kgCO2/Litre)","(kgCO2/kg)"]
["ACT",0.95,6.3888888888888884E-2,2.8486799999999999,2.3064]
["NSW",0.95,6.3888888888888884E-2,2.8486799999999999,2.3064]
["NT",0.95,6.3888888888888884E-2,2.8486799999999999,2.3064]
["QLD",0.95,6.3888888888888884E-2,2.8486799999999999,2.3064]
{"$rows_left_out":41}
{"sheet":"SSC (A)","index":12,"n_rows":13,"n_cols":6,"rows_kept":13,"cut":false,"hidden":true,"merged":[[3,0,3,5],[1,0,1,5],[0,0,0,5]]}
["APARTMENT BUILDING RATING"]
["The State Specific Co-efficient"]
[]
["State Specific coefficients (A): "]
["Premise state",2020,"2025 SLOW","2030 SLOW","2025 RAPID","2030 RAPID"]
["ACT",0.95,0.66900000000000004,0.57899999999999996,0.63200000000000001,0.313]
["NSW",0.95,0.66900000000000004,0.57899999999999996,0.63200000000000001,0.313]
["NT",0.95,0.66900000000000004,0.57899999999999996,0.63200000000000001,0.313]
["QLD",0.95,0.66900000000000004,0.57899999999999996,0.63200000000000001,0.313]
["SA",0.95,0.66900000000000004,0.57899999999999996,0.63200000000000001,0.313]
{"$rows_left_out":4}
{"sheet":"BenchmarkFactors","index":13,"n_rows":604,"n_cols":6,"rows_kept":604,"cut":false,"hidden":true,"merged":[]}
["Energy & Water","Benchmark Factors"]
["Lower Limit","Upper Limit","Star Rating",null,"Interpolated Bands"]
[0,26.5,6,null,"Ratio","Stars"]
[26.5,39.75,5.5,null,26.5,6]
[39.75,53,5,null,26.764999999999986,5.99]
[53,66.25,4.5,null,27.03,5.98]
[66.25,79.5,4,null,27.295000000000016,5.97]
[79.5,92.75,3.5,null,27.560000000000002,5.96]
[92.75,106,3,null,27.824999999999989,5.95]
[106,119.25,2.5,null,28.090000000000003,5.94]
{"$rows_left_out":595}
{"sheet":"Rating Bands","index":14,"n_rows":618,"n_cols":3,"rows_kept":618,"cut":false,"hidden":true,"merged":[[15,1,15,2]]}
[]
[]
[null,"Stars","Ratio"]
[null,0,185.5]
[null,1,{"$f":"C6+$A$18","v":159}]
[null,1.5,145.75]
[null,2,132.5]
[null,2.5,119.25]
[null,3,106]
[null,3.5,92.75]
{"$rows_left_out":609}
{"sheet":"NGA Factors 2020","index":15,"n_rows":20,"n_cols":15,"rows_kept":20,"cut":false,"hidden":true,"merged":[]}
["Fuel Type","State",null,"Scope 1 \nEF","Scope 2\nEF","Scope 3\nEF","Emissions Factors unit (scope 1, scope 2 and scope 3","Energy Content Factor","Emissions Content Factor unit","Scopes 1&2","Scopes 1,2&3","Emissions Factors unit (scope 1&2 and 1,2&3)","Scopes 1&2","Scopes 1,2&3","Emissions Factors unit (scope 1&2 and 1,2&3)"]
["Electricity","ACT",{"$f":"CONCATENATE(B2,A2)","v":"ACTElectricity"},0,0.81,0.09,"kgCO2-e/kWh",null,null,0.81,0.9,"kgCO2-e/kWh",{"$f":"J2","v":0.81},{"$f":"K2","v":0.9},"kgCO2-e/kWh"]
["Electricity","NSW",{"$f":"CONCATENATE(B3,A3)","v":"NSWElectricity"},0,0.81,0.09,"kgCO2-e/kWh",null,null,0.81,0.9,"kgCO2-e/kWh",{"$f":"J3","v":0.81},0.9,"kgCO2-e/kWh"]
["Electricity","NT","NTElectricity",0,0.62,7.0000000000000007E-2,"kgCO2-e/kWh",null,null,0.62,0.69,"kgCO2-e/kWh",0.62,0.69,"kgCO2-e/kWh"]
["Electricity","QLD","QLDElectricity",0,0.81,0.12,"kgCO2-e/kWh",null,null,0.81,0.93,"kgCO2-e/kWh",0.81,0.93,"kgCO2-e/kWh"]
["Electricity","SA","SAElectricity",0,0.43,0.09,"kgCO2-e/kWh",null,null,0.43,0.52,"kgCO2-e/kWh",0.43,0.52,"kgCO2-e/kWh"]
["Electricity","TAS","TASElectricity",0,0.17,0.02,"kgCO2-e/kWh",null,null,0.17,0.19,"kgCO2-e/kWh",0.17,0.19,"kgCO2-e/kWh"]
["Electricity","VIC","VICElectricity",0,0.98,0.11,"kgCO2-e/kWh",null,null,0.98,1.0900000000000001,"kgCO2-e/kWh",0.98,1.0900000000000001,"kgCO2-e/kWh"]
["Electricity","WA","WAElectricity",0,0.68,0.02,"kgCO2-e/kWh",null,null,0.68,0.70000000000000007,"kgCO2-e/kWh",0.68,0.70000000000000007,"kgCO2-e/kWh"]
["Gas","ACT","ACTGas",51.53,0,13.1,"kgCO2-e/GJ",null,null,5.1529999999999999E-2,6.4629999999999993E-2,"kgCO2-e/MJ",{"$f":"J10*3.6","v":0.18550800000000001},{"$f":"K10*3.6","v":0.23266799999999999},"kgCO2-e/kWh"]
{"$rows_left_out":10}